To protect your data, the CISO officer has suggested users to enable GitLab 2FA as soon as possible.

Undo accidentally changing in batick.cnf

15 jobs for version-bump-avrora in 28 minutes and 9 seconds (queued for 56 minutes and 35 seconds)
Name Stage Failure
failed
tradesoap Test There is an unknown failure, please try again
     [exec] Result: 1
[echo] tradesoap: FAIL

BUILD FAILED
/home/gitlab-runner/builds/8f85a92c/0/dacapo/anu-dev/dacapobench/benchmarks/build.xml:432: The following error occurred while executing this line:
/home/gitlab-runner/builds/8f85a92c/0/dacapo/anu-dev/dacapobench/benchmarks/build.xml:381: tradesoap: FAIL

Total time: 1 minute 20 seconds
ERROR: Job failed: exit status 1
failed
tradebeans Test There is an unknown failure, please try again
     [exec] Result: 1
[echo] tradebeans: FAIL

BUILD FAILED
/home/gitlab-runner/builds/8f85a92c/0/dacapo/anu-dev/dacapobench/benchmarks/build.xml:429: The following error occurred while executing this line:
/home/gitlab-runner/builds/8f85a92c/0/dacapo/anu-dev/dacapobench/benchmarks/build.xml:381: tradebeans: FAIL

Total time: 1 minute 43 seconds
ERROR: Job failed: exit status 1
failed
tomcat Test There is an unknown failure, please try again
     [exec] Result: 1
[echo] tomcat: FAIL

BUILD FAILED
/home/gitlab-runner/builds/8f85a92c/0/dacapo/anu-dev/dacapobench/benchmarks/build.xml:426: The following error occurred while executing this line:
/home/gitlab-runner/builds/8f85a92c/0/dacapo/anu-dev/dacapobench/benchmarks/build.xml:381: tomcat: FAIL

Total time: 34 seconds
ERROR: Job failed: exit status 1
failed
jython Test There is an unknown failure, please try again
     [exec] Result: 1
[echo] jython: FAIL

BUILD FAILED
/home/gitlab-runner/builds/8f85a92c/0/dacapo/anu-dev/dacapobench/benchmarks/build.xml:408: The following error occurred while executing this line:
/home/gitlab-runner/builds/8f85a92c/0/dacapo/anu-dev/dacapobench/benchmarks/build.xml:381: jython: FAIL

Total time: 1 minute 1 second
ERROR: Job failed: exit status 1
failed
h2 Test There is an unknown failure, please try again
     [exec] Result: 1
[echo] h2: FAIL

BUILD FAILED
/home/gitlab-runner/builds/8f85a92c/0/dacapo/anu-dev/dacapobench/benchmarks/build.xml:399: The following error occurred while executing this line:
/home/gitlab-runner/builds/8f85a92c/0/dacapo/anu-dev/dacapobench/benchmarks/build.xml:381: h2: FAIL

Total time: 39 seconds
ERROR: Job failed: exit status 1
failed
eclipse Test There is an unknown failure, please try again
     [exec] Result: 1
[echo] eclipse: FAIL

BUILD FAILED
/home/gitlab-runner/builds/8f85a92c/0/dacapo/anu-dev/dacapobench/benchmarks/build.xml:402: The following error occurred while executing this line:
/home/gitlab-runner/builds/8f85a92c/0/dacapo/anu-dev/dacapobench/benchmarks/build.xml:381: eclipse: FAIL

Total time: 16 minutes 55 seconds
ERROR: Job failed: exit status 1
failed
batik Test There is an unknown failure, please try again
     [exec] Result: 1
[echo] batik: FAIL

BUILD FAILED
/home/gitlab-runner/builds/8f85a92c/0/dacapo/anu-dev/dacapobench/benchmarks/build.xml:396: The following error occurred while executing this line:
/home/gitlab-runner/builds/8f85a92c/0/dacapo/anu-dev/dacapobench/benchmarks/build.xml:381: batik: FAIL

Total time: 31 seconds
ERROR: Job failed: exit status 1