WARNING! Access to this system is limited to authorised users only.
Unauthorised users may be subject to prosecution.
Unauthorised access to this system is a criminal offence under Australian law (Federal Crimes Act 1914 Part VIA)
It is a criminal offence to:
(1) Obtain access to data without authority. -Penalty 2 years imprisonment.
(2) Damage, delete, alter or insert data without authority. -Penalty 10 years imprisonment.
User activity is monitored and recorded. Anyone using this system expressly consents to such monitoring and recording.

To protect your data, the CISO officer has suggested users to enable 2FA as soon as possible.
Currently 2.7% of users enabled 2FA.

Merge branch 'version-bump-tomcat'

15 jobs for master in 23 minutes and 59 seconds (queued for 39 minutes and 42 seconds)
Name Stage Failure
failed
eclipse Test There is an unknown failure, please try again
     [exec] Result: 1
[echo] eclipse: FAIL

BUILD FAILED
/home/gitlab-runner/builds/8f85a92c/0/dacapo/anu-dev/dacapobench/benchmarks/build.xml:402: The following error occurred while executing this line:
/home/gitlab-runner/builds/8f85a92c/0/dacapo/anu-dev/dacapobench/benchmarks/build.xml:381: eclipse: FAIL

Total time: 7 minutes 25 seconds
ERROR: Job failed: exit status 1
failed
tradesoap Test There is an unknown failure, please try again
     [exec] Result: 1
[echo] tradesoap: FAIL

BUILD FAILED
/home/gitlab-runner/builds/8f85a92c/0/dacapo/anu-dev/dacapobench/benchmarks/build.xml:432: The following error occurred while executing this line:
/home/gitlab-runner/builds/8f85a92c/0/dacapo/anu-dev/dacapobench/benchmarks/build.xml:381: tradesoap: FAIL

Total time: 1 minute 29 seconds
ERROR: Job failed: exit status 1
failed
tradebeans Test There is an unknown failure, please try again
     [exec] Result: 1
[echo] tradebeans: FAIL

BUILD FAILED
/home/gitlab-runner/builds/8f85a92c/0/dacapo/anu-dev/dacapobench/benchmarks/build.xml:429: The following error occurred while executing this line:
/home/gitlab-runner/builds/8f85a92c/0/dacapo/anu-dev/dacapobench/benchmarks/build.xml:381: tradebeans: FAIL

Total time: 1 minute 32 seconds
ERROR: Job failed: exit status 1