WARNING! Access to this system is limited to authorised users only.
Unauthorised users may be subject to prosecution.
Unauthorised access to this system is a criminal offence under Australian law (Federal Crimes Act 1914 Part VIA)
It is a criminal offence to:
(1) Obtain access to data without authority. -Penalty 2 years imprisonment.
(2) Damage, delete, alter or insert data without authority. -Penalty 10 years imprisonment.
User activity is monitored and recorded. Anyone using this system expressly consents to such monitoring and recording.

To protect your data, the CISO officer has suggested users to enable 2FA as soon as possible.
Currently 2.7% of users enabled 2FA.

bump PMD version to 6.1.0

15 jobs for version-bump-pmd in 17 minutes and 10 seconds (queued for 3 seconds)
Status Name Job ID Coverage
  Test
failed avrora #19095

00:06:40

failed batik #19096

00:00:25

failed eclipse #19097

00:01:42

passed fop #19098

00:00:38

failed h2 #19099

00:00:41

failed jython #19100

00:00:13

passed luindex #19101

00:00:31

passed lusearch #19102

00:00:30

passed lusearch-fix #19103

00:00:29

failed pmd #19104

00:00:45

passed sunflow #19105

00:00:31

failed tomcat #19106

00:00:40

failed tradebeans #19107

00:01:24

failed tradesoap #19108

00:01:16

passed xalan #19109

00:00:36

 
Name Stage Failure
failed
tradesoap Test There is an unknown failure, please try again
     [exec] Result: 1
[echo] tradesoap: FAIL

BUILD FAILED
/home/gitlab-runner/builds/8f85a92c/0/dacapo/anu-dev/dacapobench/benchmarks/build.xml:432: The following error occurred while executing this line:
/home/gitlab-runner/builds/8f85a92c/0/dacapo/anu-dev/dacapobench/benchmarks/build.xml:381: tradesoap: FAIL

Total time: 1 minute 11 seconds
ERROR: Job failed: exit status 1
failed
tradebeans Test There is an unknown failure, please try again
     [exec] Result: 1
[echo] tradebeans: FAIL

BUILD FAILED
/home/gitlab-runner/builds/8f85a92c/0/dacapo/anu-dev/dacapobench/benchmarks/build.xml:429: The following error occurred while executing this line:
/home/gitlab-runner/builds/8f85a92c/0/dacapo/anu-dev/dacapobench/benchmarks/build.xml:381: tradebeans: FAIL

Total time: 1 minute 21 seconds
ERROR: Job failed: exit status 1
failed
tomcat Test There is an unknown failure, please try again
     [exec] Result: 1
[echo] tomcat: FAIL

BUILD FAILED
/home/gitlab-runner/builds/8f85a92c/0/dacapo/anu-dev/dacapobench/benchmarks/build.xml:426: The following error occurred while executing this line:
/home/gitlab-runner/builds/8f85a92c/0/dacapo/anu-dev/dacapobench/benchmarks/build.xml:381: tomcat: FAIL

Total time: 34 seconds
ERROR: Job failed: exit status 1
failed
pmd Test There is an unknown failure, please try again
     [exec] Result: 1
[echo] pmd: FAIL

BUILD FAILED
/home/gitlab-runner/builds/8f85a92c/0/dacapo/anu-dev/dacapobench/benchmarks/build.xml:420: The following error occurred while executing this line:
/home/gitlab-runner/builds/8f85a92c/0/dacapo/anu-dev/dacapobench/benchmarks/build.xml:381: pmd: FAIL

Total time: 42 seconds
ERROR: Job failed: exit status 1
failed
jython Test There is an unknown failure, please try again
     [exec] Result: 1
[echo] jython: FAIL

BUILD FAILED
/home/gitlab-runner/builds/8f85a92c/0/dacapo/anu-dev/dacapobench/benchmarks/build.xml:408: The following error occurred while executing this line:
/home/gitlab-runner/builds/8f85a92c/0/dacapo/anu-dev/dacapobench/benchmarks/build.xml:381: jython: FAIL

Total time: 10 seconds
ERROR: Job failed: exit status 1
failed
h2 Test There is an unknown failure, please try again
     [exec] Result: 1
[echo] h2: FAIL

BUILD FAILED
/home/gitlab-runner/builds/8f85a92c/0/dacapo/anu-dev/dacapobench/benchmarks/build.xml:399: The following error occurred while executing this line:
/home/gitlab-runner/builds/8f85a92c/0/dacapo/anu-dev/dacapobench/benchmarks/build.xml:381: h2: FAIL

Total time: 37 seconds
ERROR: Job failed: exit status 1
failed
eclipse Test There is an unknown failure, please try again
     [exec] Result: 1
[echo] eclipse: FAIL

BUILD FAILED
/home/gitlab-runner/builds/8f85a92c/0/dacapo/anu-dev/dacapobench/benchmarks/build.xml:402: The following error occurred while executing this line:
/home/gitlab-runner/builds/8f85a92c/0/dacapo/anu-dev/dacapobench/benchmarks/build.xml:381: eclipse: FAIL

Total time: 1 minute 39 seconds
ERROR: Job failed: exit status 1
failed
avrora Test There is an unknown failure, please try again
     [exec] Result: 1
[echo] avrora: FAIL

BUILD FAILED
/home/gitlab-runner/builds/8f85a92c/0/dacapo/anu-dev/dacapobench/benchmarks/build.xml:393: The following error occurred while executing this line:
/home/gitlab-runner/builds/8f85a92c/0/dacapo/anu-dev/dacapobench/benchmarks/build.xml:381: avrora: FAIL

Total time: 6 minutes 31 seconds
ERROR: Job failed: exit status 1
failed
batik Test There is an unknown failure, please try again
     [exec] Result: 1
[echo] batik: FAIL

BUILD FAILED
/home/gitlab-runner/builds/8f85a92c/0/dacapo/anu-dev/dacapobench/benchmarks/build.xml:396: The following error occurred while executing this line:
/home/gitlab-runner/builds/8f85a92c/0/dacapo/anu-dev/dacapobench/benchmarks/build.xml:381: batik: FAIL

Total time: 22 seconds
ERROR: Job failed: exit status 1