[Lucene] Resovled the type def problem, so lucenne does not need to run twice

15 jobs for version-bump-lusearch in 14 minutes and 39 seconds (queued for 8 seconds)
Status Job ID Name Coverage
  Test
passed #19456
avrora

00:00:31

failed #19457
batik

00:00:26

failed #19458
eclipse

00:04:20

passed #19459
fop

00:00:38

failed #19460
h2

00:00:33

failed #19461
jython

00:00:12

passed #19462
luindex

00:00:54

passed #19463
lusearch

00:00:50

failed #19464
lusearch-fix

00:00:44

passed #19465
pmd

00:00:49

passed #19466
sunflow

00:00:33

failed #19467
tomcat

00:00:39

failed #19468
tradebeans

00:01:34

failed #19469
tradesoap

00:01:15

passed #19470
xalan

00:00:35

 
Name Stage Failure
failed
batik Test There is an unknown failure, please try again
     [exec] Result: 1
[echo] batik: FAIL

BUILD FAILED
/home/gitlab-runner/builds/8f85a92c/0/dacapo/anu-dev/dacapobench/benchmarks/build.xml:396: The following error occurred while executing this line:
/home/gitlab-runner/builds/8f85a92c/0/dacapo/anu-dev/dacapobench/benchmarks/build.xml:381: batik: FAIL

Total time: 22 seconds
ERROR: Job failed: exit status 1
failed
eclipse Test There is an unknown failure, please try again
     [exec] Result: 1
[echo] eclipse: FAIL

BUILD FAILED
/home/gitlab-runner/builds/8f85a92c/0/dacapo/anu-dev/dacapobench/benchmarks/build.xml:402: The following error occurred while executing this line:
/home/gitlab-runner/builds/8f85a92c/0/dacapo/anu-dev/dacapobench/benchmarks/build.xml:381: eclipse: FAIL

Total time: 4 minutes 17 seconds
ERROR: Job failed: exit status 1
failed
h2 Test There is an unknown failure, please try again
     [exec] Result: 1
[echo] h2: FAIL

BUILD FAILED
/home/gitlab-runner/builds/8f85a92c/0/dacapo/anu-dev/dacapobench/benchmarks/build.xml:399: The following error occurred while executing this line:
/home/gitlab-runner/builds/8f85a92c/0/dacapo/anu-dev/dacapobench/benchmarks/build.xml:381: h2: FAIL

Total time: 30 seconds
ERROR: Job failed: exit status 1
failed
lusearch-fix Test There is an unknown failure, please try again
     [exec] Result: 1
[echo] lusearch-fix: FAIL

BUILD FAILED
/home/gitlab-runner/builds/8f85a92c/0/dacapo/anu-dev/dacapobench/benchmarks/build.xml:417: The following error occurred while executing this line:
/home/gitlab-runner/builds/8f85a92c/0/dacapo/anu-dev/dacapobench/benchmarks/build.xml:381: lusearch-fix: FAIL

Total time: 40 seconds
ERROR: Job failed: exit status 1
failed
tomcat Test There is an unknown failure, please try again
     [exec] Result: 1
[echo] tomcat: FAIL

BUILD FAILED
/home/gitlab-runner/builds/8f85a92c/0/dacapo/anu-dev/dacapobench/benchmarks/build.xml:426: The following error occurred while executing this line:
/home/gitlab-runner/builds/8f85a92c/0/dacapo/anu-dev/dacapobench/benchmarks/build.xml:381: tomcat: FAIL

Total time: 35 seconds
ERROR: Job failed: exit status 1
failed
tradebeans Test There is an unknown failure, please try again
     [exec] Result: 1
[echo] tradebeans: FAIL

BUILD FAILED
/home/gitlab-runner/builds/8f85a92c/0/dacapo/anu-dev/dacapobench/benchmarks/build.xml:429: The following error occurred while executing this line:
/home/gitlab-runner/builds/8f85a92c/0/dacapo/anu-dev/dacapobench/benchmarks/build.xml:381: tradebeans: FAIL

Total time: 1 minute 31 seconds
ERROR: Job failed: exit status 1
failed
tradesoap Test There is an unknown failure, please try again
     [exec] Result: 1
[echo] tradesoap: FAIL

BUILD FAILED
/home/gitlab-runner/builds/8f85a92c/0/dacapo/anu-dev/dacapobench/benchmarks/build.xml:432: The following error occurred while executing this line:
/home/gitlab-runner/builds/8f85a92c/0/dacapo/anu-dev/dacapobench/benchmarks/build.xml:381: tradesoap: FAIL

Total time: 1 minute 11 seconds
ERROR: Job failed: exit status 1
failed
jython Test There is an unknown failure, please try again
     [exec] Result: 1
[echo] jython: FAIL

BUILD FAILED
/home/gitlab-runner/builds/8f85a92c/0/dacapo/anu-dev/dacapobench/benchmarks/build.xml:408: The following error occurred while executing this line:
/home/gitlab-runner/builds/8f85a92c/0/dacapo/anu-dev/dacapobench/benchmarks/build.xml:381: jython: FAIL

Total time: 8 seconds
ERROR: Job failed: exit status 1