fix: harness class loader path null pointer exception

16 jobs for callback-path-fix in 4217 minutes and 56 seconds (queued for 3 seconds)
Status Job ID Name Coverage
  Test
failed #20001
avrora

passed #19987
batik

00:00:40

failed #19988
eclipse

00:58:10

failed #19989
fop

00:00:43

passed #19990
h2

00:01:59

passed #19991
jython

00:02:37

passed #19992
luindex

00:00:54

passed #19993
lusearch

00:00:51

failed #19994
lusearch-fix

00:00:01

passed #19995
pmd

00:05:53

passed #19996
sunflow

00:00:44

passed #19997
tomcat

00:02:13

failed #19998
tradebeans

00:04:33

failed #19999
tradesoap

68:58:32

failed #20000
xalan

failed #19986
avrora

00:03:07

 
Name Stage Failure
failed
tradesoap Test There is an unknown failure, please try again
	at org.dacapo.harness.TestHarness.main(TestHarness.java:153)
at sun.reflect.NativeMethodAccessorImpl.invoke0(Native Method)
at sun.reflect.NativeMethodAccessorImpl.invoke(NativeMethodAccessorImpl.java:62)
at sun.reflect.DelegatingMethodAccessorImpl.invoke(DelegatingMethodAccessorImpl.java:43)
at java.lang.reflect.Method.invoke(Method.java:498)
at Harness.main(Unknown Source)

===== DaCapo 9.12-MR1-git+a3c2867 tradesoap starting =====
ERROR: Job failed: execution took longer than 1h0m0s seconds
failed
eclipse Test There is an unknown failure, please try again
     [exec] Result: 1
[echo] eclipse: FAIL

BUILD FAILED
/home/gitlab-runner/builds/8f85a92c/0/dacapo/anu-dev/dacapobench/benchmarks/build.xml:408: The following error occurred while executing this line:
/home/gitlab-runner/builds/8f85a92c/0/dacapo/anu-dev/dacapobench/benchmarks/build.xml:387: eclipse: FAIL

Total time: 58 minutes 8 seconds
ERROR: Job failed: exit status 1
failed
fop Test There is an unknown failure, please try again
Caused by: org.dacapo.harness.DacapoException: No such file: "jar/batik-all-1.9.jar"
at org.dacapo.harness.Benchmark.extractFileResource(Benchmark.java:595)
at org.dacapo.harness.Benchmark.prepareJars(Benchmark.java:251)
at org.dacapo.harness.Benchmark.initialize(Benchmark.java:235)
at org.dacapo.harness.Benchmark.<init>(Benchmark.java:216)
at org.dacapo.harness.Benchmark.<init>(Benchmark.java:208)
at org.dacapo.harness.Fop.<init>(Fop.java:26)
... 11 more
ERROR: Job failed: exit status 1
failed
lusearch-fix Test There is an unknown failure, please try again
jdk9home=/usr/lib/jvm/java-9-openjdk-amd64
$ ant -Dbuild.target-jar=dacapo.jar lusearch-fix
Buildfile: /home/gitlab-runner/builds/8f85a92c/0/dacapo/anu-dev/dacapobench/benchmarks/build.xml

BUILD FAILED
Target "lusearch-fix" does not exist in the project "DacapoBenchmarks".

Total time: 0 seconds
ERROR: Job failed: exit status 1
failed
xalan Test There has been a timeout failure or the job got stuck. Check your timeout limits or try again
No job trace
failed
avrora Test There has been a timeout failure or the job got stuck. Check your timeout limits or try again
No job trace
failed
tradebeans Test There is an unknown failure, please try again
     [exec] Result: 1
[echo] tradebeans: FAIL

BUILD FAILED
/home/gitlab-runner/builds/8f85a92c/0/dacapo/anu-dev/dacapobench/benchmarks/build.xml:432: The following error occurred while executing this line:
/home/gitlab-runner/builds/8f85a92c/0/dacapo/anu-dev/dacapobench/benchmarks/build.xml:387: tradebeans: FAIL

Total time: 4 minutes 32 seconds
ERROR: Job failed: exit status 1